{"text_format":"1","workbook":"xlsx","n_sheets":30,"sheets":["Cover Page","Instructions","FAQ","Index","0.1 Input Background","0.2 Unit cost  assumptions","0.4 All inputs","0.5 UI backend","0.6 UI Inputs","0.7 UI input conversion","0.8 Assumptions","0.9 Default parameters","1. Enrolment","1.1 Backend","2. human resource","0.3 HR compensation","2.1 Org_Structure","3. Helpdesk,IEC and T&CB","4. Software","5. Facility cost","6. Identity Credential","6.1 Feature cost ","7. Central IT","7.1 backend","8. Model Output","8.1 Scenario 1","8.2 Scenario 2","8.3 Scenario 3","8.4 Scenario 4","9. Graphs"],"not_rendered":{"charts":11,"images":10,"macros":1,"external_links":0,"defined_names":10,"comments":0,"pivot_tables":0},"unopened":[],"bounds":{"document_bytes":16777216,"sheet_cells":100000,"rows_first":2000,"rows_last":500,"rows_between":2000,"halvings":0,"cell_chars":16384,"cell_head_chars":4096},"cells_cut":0,"cells_raw":0,"read":"whole","date_system":"1900"}

{"sheet":"Cover Page","index":0,"n_rows":27,"n_cols":13,"rows_kept":27,"cut":false,"hidden":false,"merged":[]}
[]
[]
[]
[]
[]
[]
{"$rows_left_out":22}
{"sheet":"Instructions","index":1,"n_rows":0,"n_cols":0,"rows_kept":0,"cut":false,"hidden":false,"merged":[]}

{"sheet":"FAQ","index":2,"n_rows":0,"n_cols":0,"rows_kept":0,"cut":false,"hidden":true,"merged":[]}

{"sheet":"Index","index":3,"n_rows":28,"n_cols":6,"rows_kept":28,"cut":false,"hidden":true,"merged":[[3,3,3,5]]}
[]
[]
[]
[null,null,null,"Cost Reference Model Index"]
[null,null,null,"S.n. ","Sheet name","Description "]
[null,null,null,1,"Instruction","It includes basic instruction and tool features. It also contains interface button to input data and compare multiple scenarios "]
{"$rows_left_out":23}
{"sheet":"0.1 Input Background","index":4,"n_rows":0,"n_cols":0,"rows_kept":0,"cut":false,"hidden":true,"merged":[]}

{"sheet":"0.2 Unit cost  assumptions","index":5,"n_rows":86,"n_cols":8,"rows_kept":86,"cut":false,"hidden":true,"merged":[[0,4,3,7]]}
[null,null,null,null,"Instructions:\nThis sheet list down the unit cost of items / services used in this model to estimate the overall project cost. Cost of these items / services are taken from industry experts, wholesale suppliers and various industry reports. \nKindly read the assumptions and calculation methodology carefully before changing these values. "]
[]
[]
[]
[]
[null,null,null,null,"Name of the item / Service","Unit cost (US $)","Description ","Source (if any)"]
{"$rows_left_out":81}
{"sheet":"0.4 All inputs","index":6,"n_rows":59,"n_cols":9,"rows_kept":59,"cut":false,"hidden":true,"merged":[]}
["All inputs required by model"]
[]
[]
[]
["Enrolment Cost Estimation "]
["Current population ","Population growth rate","Birth rate","Current year","Eligible population ","Enrolment start year","Enrolment phase completion year","Target coverage during enrolment phase"]
{"$rows_left_out":54}
{"sheet":"0.5 UI backend","index":7,"n_rows":32,"n_cols":4,"rows_kept":32,"cut":false,"hidden":true,"merged":[]}
[]
["Type of chip ",null,null,"Linkages with Civil Registration Department"]
["Contact Chip ",null,null,"No linkages with CR department"]
["Contactless chip",null,null,"Only infrastructure is shared"]
["Dual interface chip ",null,null,"Only Human Resources is shared"]
["Hybrid chip ",null,null,"Both infra and Human Resources are shared"]
{"$rows_left_out":27}
{"sheet":"0.6 UI Inputs","index":8,"n_rows":24,"n_cols":3,"rows_kept":24,"cut":false,"hidden":true,"merged":[]}
["Q. What is the population of country ?",17094130,2018]
["Q. What is the average population growth rate ?",2.93]
["Q. What is the average birth rate ?",4.1500000000000004]
["Q. What percentage of the population is rural population ?",58.62]
["Q. What is the gross national income (GNI) per capita of the country ? ",4000]
[]
{"$rows_left_out":19}
{"sheet":"0.7 UI input conversion","index":9,"n_rows":25,"n_cols":3,"rows_kept":25,"cut":false,"hidden":true,"merged":[]}
["Q. What is the population of country ?",{"$f":"'0.6 UI Inputs'!B1","v":17094130},{"$f":"'0.6 UI Inputs'!C1","v":2018}]
["Q. What is the average population growth rate ?",{"$f":"'0.6 UI Inputs'!B2/100","v":2.9300000000000003E-2}]
["Q. What is the average birth rate ?",{"$f":"'0.6 UI Inputs'!B3/100","v":4.1500000000000002E-2}]
["Q. What percentage of the population is rural population ?",{"$f":"'0.6 UI Inputs'!B4/100","v":0.58619999999999994}]
["Q. What is the gross national income (GNI) per of the country ? ",{"$f":"'0.6 UI Inputs'!B5","v":4000}]
["Q. What is the average annual consumer price inflation ?",{"$f":"'0.6 UI Inputs'!B6/100","v":0}]
{"$rows_left_out":20}
{"sheet":"0.8 Assumptions","index":10,"n_rows":0,"n_cols":0,"rows_kept":0,"cut":false,"hidden":true,"merged":[]}

{"sheet":"0.9 Default parameters","index":11,"n_rows":51,"n_cols":8,"rows_kept":51,"cut":false,"hidden":true,"merged":[]}
["Default Parameters "]
[]
[]
[]
["Enrolment Cost Estimation "]
["Parameter","Target coverage during enrolment phase","Working hours per day ","Working days per year","Fixed enrolment station working efficiency","mobile enrolment station working efficiency ","% of rural population require mobile enrolment center","Mandatory biometric update required "]
{"$rows_left_out":46}
{"sheet":"1. Enrolment","index":12,"n_rows":46,"n_cols":19,"rows_kept":46,"cut":false,"hidden":true,"merged":[[12,0,16,0],[18,0,25,0],[30,0,37,0],[40,0,45,0]]}
["1. Enrolment Station Cost Estimation"]
[]
["Component","Current population ","Population growth rate","Birth rate","Current year","Eligible population ","Enrolment start year","Enrolment phase completion year","Target coverage during enrolment phase","Rural population ","Finger print required ?","no.of finger print","Iris required","no. of iris","Voice : Biometric","Facial photograph","electronic signature","no. of demographic points"]
["Value",{"$f":"'0.4 All inputs'!A7","v":17094130},{"$f":"'0.4 All inputs'!B7","v":2.9300000000000003E-2},{"$f":"'0.4 All inputs'!C7","v":4.1500000000000002E-2},{"$f":"'0.4 All inputs'!D7","v":2018},{"$f":"'0.4 All inputs'!E7","v":0.7},{"$f":"'0.4 All inputs'!F7","v":2019},{"$f":"'0.4 All inputs'!G7","v":2021},{"$f":"'0.4 All inputs'!H7","v":0.9},{"$f":"'0.4 All inputs'!A11","v":0.58619999999999994},{"$f":"'0.4 All inputs'!B11","v":1},{"$f":"'0.4 All inputs'!C11","v":10},{"$f":"'0.4 All inputs'!D11","v":0},{"$f":"'0.4 All inputs'!E11","v":0},{"$f":"'0.4 All inputs'!F11","v":0},{"$f":"'0.4 All inputs'!G11","v":1},{"$f":"'0.4 All inputs'!H11","v":0},{"$f":"'0.4 All inputs'!I11","v":0}]
["Description "]
[]
{"$rows_left_out":41}
{"sheet":"1.1 Backend","index":13,"n_rows":88,"n_cols":27,"rows_kept":88,"cut":false,"hidden":true,"merged":[[63,0,63,3],[66,0,66,3],[68,0,68,3],[41,0,41,3],[53,0,53,3],[56,0,56,3],[58,0,58,3],[60,0,60,3]]}
["Population in 2016 ","Population growth rate ","Birth rate ","Eligible population for NID"]
[{"$f":"'1. Enrolment'!B4","v":17094130},{"$f":"'1. Enrolment'!C4","v":2.9300000000000003E-2},{"$f":"'1. Enrolment'!D4","v":4.1500000000000002E-2},{"$f":"'1. Enrolment'!F4","v":0.7}]
[]
[]
[]
[]
{"$rows_left_out":83}
{"sheet":"2. human resource","index":14,"n_rows":19,"n_cols":18,"rows_kept":19,"cut":false,"hidden":true,"merged":[]}
["Human resource cost estimation "]
[]
["Component","no. of employee at each enrolment station ","No. of Regional offices required","No. of district office required","Hiring cost ","Shared human resources with CRVS","Reduction in human resources cost due to CRVS linkages"]
["Value",{"$f":"'0.4 All inputs'!A20","v":2},{"$f":"'0.4 All inputs'!B20","v":20},{"$f":"'0.4 All inputs'!C20","v":765},{"$f":"'0.4 All inputs'!D20","v":0.05},{"$f":"'0.4 All inputs'!B58","v":0},{"$f":"'0.4 All inputs'!D58","v":0.3}]
["Description ",null,null,null,"% of total annual compensation ","yes=1 , no = 0 ","yes=1 , no = 0 "]
[]
{"$rows_left_out":14}
{"sheet":"0.3 HR compensation","index":15,"n_rows":61,"n_cols":12,"rows_kept":61,"cut":false,"hidden":true,"merged":[[0,6,3,11]]}
[null,null,null,null,null,null,"Instruction: \nThis section list the level wise salary across various departments. As a benchmark salary for various levels, wage estimates (Column \"H\") of Bureau of Labor statistics is considered. This value is then multiplied with ratio of per capita income for selected country and USA (Column \"I\") to estimate the wage levels for selected country. Additional allowances (Column \"K\") has been also added in the salary. Kindly change the relevant values (column H,J) to changes the salary (Column \"K\"). "]
[]
[]
[]
[]
[null,null,null,null,null,null,"US per capital Income ",58700,"2016, PPP US $, WB databank"]
{"$rows_left_out":56}
{"sheet":"2.1 Org_Structure","index":16,"n_rows":88,"n_cols":22,"rows_kept":88,"cut":false,"hidden":true,"merged":[[0,0,3,6],[28,0,30,0],[12,0,15,0],[16,0,18,0],[19,0,21,0],[22,0,24,0],[25,0,27,0],[31,0,33,0],[34,0,36,0],[37,0,39,0],[40,0,42,0],[43,0,45,0],[68,0,70,0],[63,0,65,0],[40,2,42,2],[71,0,73,0],[49,0,51,0],[52,0,54,0],[55,0,56,0],[60,0,62,0],[66,0,67,0],[46,0,48,0]]}
["Instruction:\nNo. of employees can be changed by changing values in column D. Before changing any values it is advised to kindly read human resources cost estimation methodology. To change the annual compensation, kindly use \"Go to Compensation List\".\nKindly do not change any other column except column D and E \n"]
[]
[]
[]
[]
[]
{"$rows_left_out":83}
{"sheet":"3. Helpdesk,IEC and T&CB","index":17,"n_rows":35,"n_cols":19,"rows_kept":35,"cut":false,"hidden":true,"merged":[[14,0,20,0],[22,0,23,0],[25,0,31,0],[33,0,34,0]]}
["Helpdesk, IEC, Training and capacity building cost estimation "]
[]
["Component","% people with grievances ","helpdesk through call center","helpdesk through enrolment stations ","helpdesk through online","Per hour cost for call center and online portal","Call center fixed cost","Per person IEC cost per year","Cost of training material","no. of operators that will be trained ","Total no. of service provider agencies","Per agency no. of operators who require training","Per training cost"]
["Value",0.02,{"$f":"'0.4 All inputs'!B25","v":0.3},{"$f":"'0.4 All inputs'!C25","v":0.5},{"$f":"1-D4-C4","v":0.2},{"$f":"'0.2 Unit cost  assumptions'!F23","v":14},{"$f":"'0.2 Unit cost  assumptions'!F24","v":50000},{"$f":"'0.4 All inputs'!G25/(completion_year-start_year+1)","v":0.16666666666666666},{"$f":"'0.2 Unit cost  assumptions'!F25","v":500000},{"$f":"'0.4 All inputs'!D25","v":1.25},{"$f":"'0.4 All inputs'!E25","v":100},{"$f":"'0.4 All inputs'!F25","v":5},{"$f":"'0.2 Unit cost  assumptions'!F26","v":2000}]
["Description ",null,null,null,null,null,"for toll free no. ","IEC outsourcing cost, includes print, social, tv, radio mediums","Video module, lecture module, assessment module, information booklet","% of actual required staff",null,null,"Cost of stationary item, cost of tutor, certification and facility cost"]
[]
{"$rows_left_out":30}
{"sheet":"4. Software","index":18,"n_rows":39,"n_cols":19,"rows_kept":39,"cut":false,"hidden":true,"merged":[[30,0,36,0],[37,0,38,0]]}
["Software development cost estimation "]
[]
["Component","Deduplication cost for one biometric","Software AMC cost","Request require manual deduplication ","Per manual dedup time (in minutes)","Manual dedup personnel cost per year","No. of biometric captured","Add on cost for additional biometric ","Per dedup cost","Per manual quality check time (in minutes)"]
["Value",{"$f":"'0.2 Unit cost  assumptions'!F37","v":0.25},{"$f":"'0.4 All inputs'!A30","v":0.25},{"$f":"IF(G4=0,0,'0.4 All inputs'!B30)","v":0.05},{"$f":"'0.4 All inputs'!C30","v":10},{"$f":"'0.3 HR compensation'!K59","v":2623.5093696763206},{"$f":"'0.4 All inputs'!B11+'0.4 All inputs'!D11+'0.4 All inputs'!G11","v":2},{"$f":"'0.2 Unit cost  assumptions'!F38","v":0.1},{"$f":"IF(G4=0, 0,IF(G4=1,0.25,B4+H4))","v":0.35},1.728]
["Description ",null,"as percentage of cost of software development",null,null,null,"Facial image not included, cost of deduplication is estimated based on the no. of biometric captured."]
[]
{"$rows_left_out":34}
{"sheet":"5. Facility cost","index":19,"n_rows":27,"n_cols":19,"rows_kept":27,"cut":false,"hidden":true,"merged":[[13,0,15,0],[17,0,19,0],[21,0,23,0],[25,0,26,0]]}
["Administration Cost estimation "]
[]
["Component","No. of Regional offices required","No. of district office required","HQ office space requirement","Regional office space requirement","District office space requirement","Per person work station setup cost","per sq. ft. office setup cost","Per person operating office expenses","Per sq. ft. office operating cost","per sq. ft. rent"]
["Value",{"$f":"'2. human resource'!C4","v":20},{"$f":"'2. human resource'!D4","v":765},{"$f":"'0.4 All inputs'!A35","v":15000},{"$f":"'0.4 All inputs'!B35","v":5000},{"$f":"'0.4 All inputs'!C35","v":1000},{"$f":"'0.2 Unit cost  assumptions'!F39","v":1000},{"$f":"'0.2 Unit cost  assumptions'!F40","v":75},{"$f":"'0.2 Unit cost  assumptions'!F41","v":300},{"$f":"'0.2 Unit cost  assumptions'!F42","v":7},{"$f":"'0.2 Unit cost  assumptions'!F43","v":5}]
["Description ",null,null,"sq. ft.","sq. ft.","sq. ft.","laptop, table chair etc.",null,"stationary , snack etc.","including maintenance, repair, internet , admin , cleaning cost (for RO and DO), excluding rent "]
[]
{"$rows_left_out":22}
{"sheet":"6. Identity Credential","index":20,"n_rows":17,"n_cols":18,"rows_kept":17,"cut":false,"hidden":true,"merged":[]}
["Identity Credential Cost Estimation "]
[]
["Component","Credential Choice ","Type of Barcode ","Type of chip based card","Mag strip ","Type of Material ","Type of security ","Delivery Cost","ID to be reissued"]
["Value",{"$f":"'0.4 All inputs'!A40","v":1},{"$f":"'0.4 All inputs'!B40","v":2},{"$f":"'0.4 All inputs'!C40","v":4},{"$f":"'0.4 All inputs'!D40","v":1},{"$f":"'0.4 All inputs'!E40","v":3},{"$f":"'0.4 All inputs'!F40","v":3},{"$f":"'0.2 Unit cost  assumptions'!F64","v":0.1},{"$f":"MIN('0.4 All inputs'!G40,'0.4 All inputs'!A25)","v":0.03}]
["Description ","0 = No credential only UIN, 1 = eID, 2 = non electronic ID","0 = no barcode, 1= 1D barcode, 2 = 2D barcode","0 = no chip, 1 = contact, 2 = contacless, 3 = Dual interface, 4 = hybrid","0 = no, 1 = yes","0 = no material, 1 = paper, 2= PVC, 3 = PC, 4 = PET, 5 = Teslin, 6 = Composite (PC+PVC)","0 = no security, 1 = level 1, 2 = level 2, 3 = level 3",null,"Due to lost or damage"]
[]
{"$rows_left_out":12}
{"sheet":"6.1 Feature cost ","index":21,"n_rows":32,"n_cols":7,"rows_kept":32,"cut":false,"hidden":true,"merged":[]}
[]
["Input no. ","Type ","Cost per unit ","Included or not","Default value due to selection ","Cost ","Description "]
[0,"No credential ",0,{"$f":"IF('6. Identity Credential'!$B$4='6.1 Feature cost '!A3,1,0)","v":0},{"$f":"D3","v":0},{"$f":"E3*D3*C3","v":0}]
[1,"eID",0,{"$f":"IF('6. Identity Credential'!$B$4='6.1 Feature cost '!A4,1,0)","v":1},{"$f":"D4","v":1},{"$f":"E4*D4*C4","v":0}]
[2,"Non electronic ID",0,{"$f":"IF('6. Identity Credential'!$B$4='6.1 Feature cost '!A5,1,0)","v":0},0,0]
[0,"No barcode",0,{"$f":"IF('6. Identity Credential'!$C$4='6.1 Feature cost '!A6,1,0)","v":0},{"$f":"IF($D$3=1,1,D6)","v":0},0]
{"$rows_left_out":27}
{"sheet":"7. Central IT","index":22,"n_rows":42,"n_cols":19,"rows_kept":42,"cut":false,"hidden":true,"merged":[[40,0,41,0],[13,0,17,0],[23,0,25,0],[18,0,22,0],[26,0,28,0]]}
["Central IT cost estimation "]
[]
["Component","per agency per person per year authentication request","Preferred biometric for authentication","Preferred biometric for deduplication ","Per person raw data size","Per person minutiae size","DC site operating expenditure","DC site installation cost","Capacity of DR as compared to DC"]
["Value",{"$f":"'0.4 All inputs'!A45","v":0.2},{"$f":"'7.1 backend'!C69","v":1},{"$f":"'7.1 backend'!C66","v":1},{"$f":"'0.4 All inputs'!D45","v":4000},{"$f":"'0.4 All inputs'!E45","v":150},{"$f":"'0.2 Unit cost  assumptions'!F65","v":500000},{"$f":"'0.2 Unit cost  assumptions'!F66","v":500000},{"$f":"'0.4 All inputs'!F45","v":1}]
["Description ",null,"0 = no biometric authentication, 1 = finger prints,  2= Iris, 3 = Voice, 4 = face","1 = finger prints,  2= Iris, 3 = Voice, 4 = face. ","in KB (including data update requests)","in KB","including electricity, security, site management, rent, WAN etc.","hardware installation, cabling etc. cost"]
[]
{"$rows_left_out":37}
{"sheet":"7.1 backend","index":23,"n_rows":69,"n_cols":19,"rows_kept":69,"cut":false,"hidden":true,"merged":[[47,0,55,0],[33,0,34,0],[35,0,37,0],[38,0,43,0]]}
[]
["Component","No. of user agencies linked with eID ","Web server capacity (no. of request per second)","Finger print equivalent to one iris ","Finger print equivalent to face","Finger print equivalent to voice ","Finger print equivalent to non biometric based authentication  ","Preferred biometric for authentication","finger print equivalent to preferred authentication medium ","Preferred biometric for deduplication ","Dedup capacity per core  per second as per selected  biometric","Web server cost ","Application server cost","Data base server cost","Cost of storage disk "]
["Value",{"$f":"'3. Helpdesk,IEC and T&CB'!K4","v":100},{"$f":"'0.4 All inputs'!E49","v":3000},4,2,2,1,{"$f":"'7. Central IT'!C4","v":1},{"$f":"IF(H3=0,G3,IF(H3=1,1,IF(H3=2,D3,IF(H3=3,F3,IF(H3=4,E3,0)))))","v":1},{"$f":"'7. Central IT'!D4","v":1},{"$f":"IF(J3=1,G7,IF(J3=2,H7,IF(J3=3,J7,IF(J3=4,I7,0))))","v":37500},{"$f":"'0.2 Unit cost  assumptions'!F67","v":15000},{"$f":"'0.2 Unit cost  assumptions'!F68","v":30000},{"$f":"'0.2 Unit cost  assumptions'!F69","v":50000},{"$f":"'0.2 Unit cost  assumptions'!F70","v":10000}]
["Description ",null,null,"One Iris authentication will be equal to 4 finger print authentication requests","One face authentication request is equal to 2 finger requests","one voice authentication request will be equal to these many finger print requests","one non biometric authentication request will be equal to these many finger print request","0 = no biometric authentication, 1 = finger prints,  2= Iris, 3 = Voice, 4 = face",null,"1 = finger prints,  2= Iris, 3 = Voice, 4 = face"]
[]
["Component","Data base server capacity (no. of request per core per second)","No . of core in webserver ","no. of core in database server","no. of core in application server","Application server capacity (no. of requests per core per second)","Finger print deduplication per core per second","Iris deduplication per core per second","Face deduplication per core per second","Voice deduplication per core per second","Storage disk minimum size ","Hardware AMC "]
{"$rows_left_out":64}
{"sheet":"8. Model Output","index":24,"n_rows":85,"n_cols":20,"rows_kept":85,"cut":false,"hidden":true,"merged":[]}
["Average inflation rate ",{"$f":"'0.4 All inputs'!G15","v":1.7999999999999999E-2}]
[]
[]
["Constant Term Output",null,{"$f":"'1. Enrolment'!D13","v":0},{"$f":"'1. Enrolment'!E13","v":1},{"$f":"'1. Enrolment'!F13","v":2},{"$f":"'1. Enrolment'!G13","v":3},{"$f":"'1. Enrolment'!H13","v":4},{"$f":"'1. Enrolment'!I13","v":5},{"$f":"'1. Enrolment'!J13","v":6},{"$f":"'1. Enrolment'!K13","v":7},{"$f":"'1. Enrolment'!L13","v":8},{"$f":"'1. Enrolment'!M13","v":9},{"$f":"'1. Enrolment'!N13","v":10},{"$f":"'1. Enrolment'!O13","v":11},{"$f":"'1. Enrolment'!P13","v":12},{"$f":"'1. Enrolment'!Q13","v":13},{"$f":"'1. Enrolment'!R13","v":14}]
[null,null,{"$f":"'1. Enrolment'!D14","v":2018},{"$f":"'1. Enrolment'!E14","v":2019},{"$f":"'1. Enrolment'!F14","v":2020},{"$f":"'1. Enrolment'!G14","v":2021},{"$f":"'1. Enrolment'!H14","v":2022},{"$f":"'1. Enrolment'!I14","v":2023},{"$f":"'1. Enrolment'!J14","v":2024},{"$f":"'1. Enrolment'!K14","v":2025},{"$f":"'1. Enrolment'!L14","v":2026},{"$f":"'1. Enrolment'!M14","v":2027},{"$f":"'1. Enrolment'!N14","v":2028},{"$f":"'1. Enrolment'!O14","v":2029},{"$f":"'1. Enrolment'!P14","v":2030},{"$f":"'1. Enrolment'!Q14","v":2031},{"$f":"'1. Enrolment'!R14","v":2032},null,"Total expenditure till completion of Enrolment phase","Average per year expenditure in steady phase"]
[null,null,{"$f":"IF('1. Enrolment'!D17=0,\"Development Year\",IF('1. Enrolment'!D17=1,\"Enrolment Phase\",IF('1. Enrolment'!D17=2,\"Steady State\")))","v":"Development Year"},{"$f":"IF('1. Enrolment'!E17=0,\"Development Year\",IF('1. Enrolment'!E17=1,\"Enrolment Phase\",IF('1. Enrolment'!E17=2,\"Steady State\")))","v":"Enrolment Phase"},{"$f":"IF('1. Enrolment'!F17=0,\"Development Year\",IF('1. Enrolment'!F17=1,\"Enrolment Phase\",IF('1. Enrolment'!F17=2,\"Steady State\")))","v":"Enrolment Phase"},{"$f":"IF('1. Enrolment'!G17=0,\"Development Year\",IF('1. Enrolment'!G17=1,\"Enrolment Phase\",IF('1. Enrolment'!G17=2,\"Steady State\")))","v":"Enrolment Phase"},{"$f":"IF('1. Enrolment'!H17=0,\"Development Year\",IF('1. Enrolment'!H17=1,\"Enrolment Phase\",IF('1. Enrolment'!H17=2,\"Steady State\")))","v":"Steady State"},{"$f":"IF('1. Enrolment'!I17=0,\"Development Year\",IF('1. Enrolment'!I17=1,\"Enrolment Phase\",IF('1. Enrolment'!I17=2,\"Steady State\")))","v":"Steady State"},{"$f":"IF('1. Enrolment'!J17=0,\"Development Year\",IF('1. Enrolment'!J17=1,\"Enrolment Phase\",IF('1. Enrolment'!J17=2,\"Steady State\")))","v":"Steady State"},{"$f":"IF('1. Enrolment'!K17=0,\"Development Year\",IF('1. Enrolment'!K17=1,\"Enrolment Phase\",IF('1. Enrolment'!K17=2,\"Steady State\")))","v":"Steady State"},{"$f":"IF('1. Enrolment'!L17=0,\"Development Year\",IF('1. Enrolment'!L17=1,\"Enrolment Phase\",IF('1. Enrolment'!L17=2,\"Steady State\")))","v":"Steady State"},{"$f":"IF('1. Enrolment'!M17=0,\"Development Year\",IF('1. Enrolment'!M17=1,\"Enrolment Phase\",IF('1. Enrolment'!M17=2,\"Steady State\")))","v":"Steady State"},{"$f":"IF('1. Enrolment'!N17=0,\"Development Year\",IF('1. Enrolment'!N17=1,\"Enrolment Phase\",IF('1. Enrolment'!N17=2,\"Steady State\")))","v":"Steady State"},{"$f":"IF('1. Enrolment'!O17=0,\"Development Year\",IF('1. Enrolment'!O17=1,\"Enrolment Phase\",IF('1. Enrolment'!O17=2,\"Steady State\")))","v":"Steady State"},{"$f":"IF('1. Enrolment'!P17=0,\"Development Year\",IF('1. Enrolment'!P17=1,\"Enrolment Phase\",IF('1. Enrolment'!P17=2,\"Steady State\")))","v":"Steady State"},{"$f":"IF('1. Enrolment'!Q17=0,\"Development Year\",IF('1. Enrolment'!Q17=1,\"Enrolment Phase\",IF('1. Enrolment'!Q17=2,\"Steady State\")))","v":"Steady State"},{"$f":"IF('1. Enrolment'!R17=0,\"Development Year\",IF('1. Enrolment'!R17=1,\"Enrolment Phase\",IF('1. Enrolment'!R17=2,\"Steady State\")))","v":"Steady State"},"Category wise Total"]
{"$rows_left_out":80}
{"sheet":"8.1 Scenario 1","index":25,"n_rows":0,"n_cols":0,"rows_kept":0,"cut":false,"hidden":true,"merged":[]}

{"sheet":"8.2 Scenario 2","index":26,"n_rows":0,"n_cols":0,"rows_kept":0,"cut":false,"hidden":true,"merged":[]}

{"sheet":"8.3 Scenario 3","index":27,"n_rows":0,"n_cols":0,"rows_kept":0,"cut":false,"hidden":true,"merged":[]}

{"sheet":"8.4 Scenario 4","index":28,"n_rows":0,"n_cols":0,"rows_kept":0,"cut":false,"hidden":true,"merged":[]}

{"sheet":"9. Graphs","index":29,"n_rows":26,"n_cols":6,"rows_kept":26,"cut":false,"hidden":true,"merged":[]}
[]
[null,"Scenario-Inputs","Scenario 1","Scenario  2","Scenario 3","Scenario 4"]
[null,"Enrolment timeline"]
[null,"Enrolment start year ",{"$f":"'8.1 Scenario 1'!B63","v":0},{"$f":"'8.2 Scenario 2'!B63","v":0},{"$f":"'8.3 Scenario 3'!B63","v":0},{"$f":"'8.4 Scenario 4'!B63","v":0}]
[null,"Enrolment phase  end  year",{"$f":"'8.1 Scenario 1'!B64","v":0},{"$f":"'8.2 Scenario 2'!B64","v":0},{"$f":"'8.3 Scenario 3'!B64","v":0},{"$f":"'8.4 Scenario 4'!B64","v":0}]
[null,"Biometric data points ",{"$f":"'8.1 Scenario 1'!B64","v":0},{"$f":"'8.2 Scenario 2'!B64","v":0},{"$f":"'8.3 Scenario 3'!B64","v":0},{"$f":"'8.4 Scenario 4'!B64","v":0}]
{"$rows_left_out":20}